BDBM112823 US8629167, 34
SMILES C[C@H](O)[C@@H](Nc1ccc(C#N)c(Cl)c1Cl)c1nnc(o1)-c1ccc(Cl)cc1
InChI Key InChIKey=FMRQUYHWRBNRDV-XXFAHNHDSA-N
Data  1 IC50
  Tab Delimited (TSV)   2D SDfile   Computed 3D by Vconf -m prep SDfile
Find this compound or compounds like it in BindingDB:
Activity Spreadsheet -- Enzyme Inhibition Constant Data from BindingDB
Found 1 hit for monomerid = 112823
TargetAndrogen receptor(Rattus norvegicus (Rat))
Radius Health
US Patent
LigandPNGBDBM112823(US8629167, 34)
Affinity DataIC50:  4nM. Assay description: In order to demonstrate the utility of the compounds of this invention, an androgen receptor binding assay was performed wherein many of the compound...
In DepthDetails US Patent